Target
Cell division protein FtsZ
Ligand
BDBM50201768
Substrate
Meas. Tech.
ChEMBL_1623495 (CHEMBL3865907)
IC50
317000±n/a nM
Citation
 Haranahalli, KTong, SOjima, I Recent advances in the discovery and development of antibacterial agents targeting the cell-division protein FtsZ. Bioorg Med Chem 24:6354-6369 (2016)  
Target
Name:
Cell division protein FtsZ
Synonyms:
FTSZ_STAAU | ftsZ
Type:
Protein
Mol. Mass.:
41023.36
Organism:
Staphylococcus aureus
Description:
P0A031
Residue:
390
  
Inhibitor
Name:
BDBM50201768
Synonyms:
CHEMBL2413354
Type:
Small organic molecule
Emp. Form.:
C20H23N5
Mol. Mass.:
333.4301
SMILES:
CC(C)(C)c1ccc(cc1)-c1ncnc2c(CNC(N)=N)cccc12
: