Target
Tyrosine-protein phosphatase non-receptor type 1
Ligand
BDBM50201800
Substrate
Meas. Tech.
ChEMBL_1625487 (CHEMBL3867956)
IC50
270±n/a nM
Citation
 Meng, GZheng, MWang, MTong, JGe, WZhang, JZheng, ALi, JGao, LLi, J Design and synthesis of new potent PTP1B inhibitors with the skeleton of 2-substituted imino-3-substituted-5-heteroarylidene-1,3-thiazolidine-4-one: Part I. Eur J Med Chem 122:756-769 (2016)  
Target
Name:
Tyrosine-protein phosphatase non-receptor type 1
Synonyms:
PTN1_HUMAN PTPN1 Protein tyrosine phosphatase-1B (PTP1B) Protein-tyrosine phosphatase 1B (PTP1B) Tyrosine-protein phosphatase non-receptor type 1 (PTP1B)
Type:
Protein phosphatase
Mol. Mass.:
49963.76
Organism:
Homo sapiens (Human)
Description:
Human recombinant GST-fusion PTP1B (1-435).
Residue:
435
  
Inhibitor
Name:
BDBM50201800
Synonyms:
CHEMBL3901092
Type:
Small organic molecule
Emp. Form.:
C25H21N5O3S2
Mol. Mass.:
503.596
SMILES:
O=C1CC(c2ccc(CC(Nc3nc4ccccc4s3)c3nc4ccccc4[nH]3)cc2)S(=O)(=O)N1
: