Target
Orexin receptor type 2
Ligand
BDBM50203744
Substrate
Meas. Tech.
ChEMBL_1625870 (CHEMBL3868339)
Ki
907±n/a nM
Citation
 Stump, CACooke, AJBruno, JCabalu, TDGotter, ALHarell, CMKuduk, SDMcDonald, TPO'Brien, JRenger, JJWilliams, PDWinrow, CJColeman, PJ Discovery of highly potent and selective orexin 1 receptor antagonists (1-SORAs) suitable for in vivo interrogation of orexin 1 receptor pharmacology. Bioorg Med Chem Lett 26:5809-5814 (2016)  
Target
Name:
Orexin receptor type 2
Synonyms:
HCRTR2 OX2R_HUMAN Orexin receptor type 2 (OR-2) Orexin receptor type 2 (OX2R) Ox-2-R | Ox2-R
Type:
Protein
Mol. Mass.:
50710.53
Organism:
Homo sapiens (Human)
Description:
O43614
Residue:
444
  
Inhibitor
Name:
BDBM50203744
Synonyms:
CHEMBL3979470
Type:
Small organic molecule
Emp. Form.:
C20H16F5N5O2
Mol. Mass.:
453.3654
SMILES:
FC(F)(F)c1cccc(OC2CN(CCC2(F)F)C(=O)c2ccccc2-n2nccn2)n1
: