Target
Orexin receptor type 2
Ligand
BDBM50203750
Substrate
Meas. Tech.
ChEMBL_1625870 (CHEMBL3868339)
Ki
627±n/a nM
Citation
 Stump, CACooke, AJBruno, JCabalu, TDGotter, ALHarell, CMKuduk, SDMcDonald, TPO'Brien, JRenger, JJWilliams, PDWinrow, CJColeman, PJ Discovery of highly potent and selective orexin 1 receptor antagonists (1-SORAs) suitable for in vivo interrogation of orexin 1 receptor pharmacology. Bioorg Med Chem Lett 26:5809-5814 (2016)  
Target
Name:
Orexin receptor type 2
Synonyms:
HCRTR2 OX2R_HUMAN Orexin receptor type 2 (OR-2) Orexin receptor type 2 (OX2R) Ox-2-R | Ox2-R
Type:
Protein
Mol. Mass.:
50710.53
Organism:
Homo sapiens (Human)
Description:
O43614
Residue:
444
  
Inhibitor
Name:
BDBM50203750
Synonyms:
CHEMBL3958483
Type:
Small organic molecule
Emp. Form.:
C24H20F2N4O2
Mol. Mass.:
434.438
SMILES:
FC1(F)CCN(C[C@@H]1Oc1ccc2ccccc2n1)C(=O)c1cccc(c1)-n1cccn1
: