Target
Free fatty acid receptor 1
Ligand
BDBM50204014
Substrate
Meas. Tech.
ChEMBL_1625978 (CHEMBL3868447)
EC50
0.300000±n/a nM
Citation
 Chen, CLi, HLong, YQ GPR40 agonists for the treatment of type 2 diabetes mellitus: The biological characteristics and the chemical space. Bioorg Med Chem Lett 26:5603-5612 (2016)  
Target
Name:
Free fatty acid receptor 1
Synonyms:
FFAR1 G-protein Coupled Receptor 40 | GPR40
Type:
G Protein-Coupled Receptor (GPCR)
Mol. Mass.:
31473.32
Organism:
Homo sapiens (Human)
Description:
O14842
Residue:
300
  
Inhibitor
Name:
BDBM50204014
Synonyms:
CHEMBL3944424 | US10059667, Example 27
Type:
Small organic molecule
Emp. Form.:
C27H29F6NO3
Mol. Mass.:
529.5145
SMILES:
C[C@@H]([C@@H](C1CC1)c1cccc(OCC2CN(C2)C(C)c2cc(ccc2C(F)(F)F)C(F)(F)F)c1)C(O)=O
: