Target
Cytochrome P450 3A4
Ligand
BDBM50204030
Substrate
Meas. Tech.
ChEMBL_1625990 (CHEMBL3868459)
IC50
8400±n/a nM
Citation
 Wu, WLBurnett, DAClader, JGreenlee, WJJiang, QHyde, LADel Vecchio, RACohen-Williams, MESong, LLee, JTerracina, GZhang, QNomeir, AParker, EMZhang, L Design and synthesis of water solubleß-aminosulfone analogues of SCH 900229 as¿-secretase inhibitors. Bioorg Med Chem Lett 26:5836-5841 (2016)  
Target
Name:
Cytochrome P450 3A4
Synonyms:
Albendazole monooxygenase CP3A4_HUMAN CYP3A4 CYPIIIA4 Cytochrome P450 3A4 (CYP3A4) Nifedipine oxidase Taurochenodeoxycholate 6-alpha-hydroxylase
Type:
Enzyme
Mol. Mass.:
57349.57
Organism:
Homo sapiens (Human)
Description:
Residue:
503
  
Inhibitor
Name:
BDBM50204030
Synonyms:
CHEMBL3904067
Type:
Small organic molecule
Emp. Form.:
C23H26ClF2NO6S2
Mol. Mass.:
550.035
SMILES:
[H][C@@]12COc3c(F)ccc(F)c3[C@@]1(CCO[C@H]2CCS(=O)(=O)CCNC)S(=O)(=O)c1ccc(Cl)cc1
: