Target
Oxysterols receptor LXR-alpha/Retinoic acid receptor RXR-alpha
Ligand
BDBM50204082
Substrate
Meas. Tech.
ChEMBL_1626046 (CHEMBL3868515)
Ki
17±n/a nM
Citation
 Kick, EKBusch, BBMartin, RStevens, WCBollu, VXie, YBoren, BCNyman, MCNanao, MHNguyen, LPlonowski, ASchulman, IGYan, GZhang, HHou, XValente, MNNarayanan, RBehnia, KRodrigues, ADBrock, BSmalley, JCantor, GHLupisella, JSleph, PGrimm, DOstrowski, JWexler, RRKirchgessner, TMohan, R Discovery of Highly Potent Liver X Receptorß Agonists. ACS Med Chem Lett 7:1207-1212 (2016)  
Target
Name:
Oxysterols receptor LXR-alpha/Retinoic acid receptor RXR-alpha
Synonyms:
Retinoic acid receptor RXR-alpha/oxysterols receptor LXR-alpha
Type:
Mol. Mass.:
Description:
ASSAY_ID of ChEMBL is 2032721
Components:
This complex has 2 components.
Component 1
Name:
Retinoic acid receptor RXR-alpha
Synonyms:
NR2B1 Nuclear receptor subfamily 4 group A member 2 RXRA Retinoic acid receptor RXR-alpha/gamma Retinoid receptor
Type:
PROTEIN
Mol. Mass.:
50820.38
Organism:
Homo sapiens (Human)
Description:
ChEMBL_1456363
Residue:
462
  
Component 2
Name:
Oxysterols receptor LXR-alpha
Synonyms:
LXRA Liver X receptor alpha Liver X receptor alpha (NR1H3) NR1H3 Nuclear orphan receptor LXR-alpha | Nuclear receptor subfamily 1 group H member 3
Type:
Enzyme Catalytic Domain
Mol. Mass.:
50403.85
Organism:
Homo sapiens (Human)
Description:
Q13133
Residue:
447
  
Inhibitor
Name:
BDBM50204082
Synonyms:
CHEMBL3945820
Type:
Small organic molecule
Emp. Form.:
C28H26Cl2F2N2O4S
Mol. Mass.:
595.485
SMILES:
CC(c1nc(cn1-c1ccc(cc1F)-c1cc(F)c(CO)c(c1)S(C)(=O)=O)C(C)(C)O)c1c(Cl)cccc1Cl
: