Target
Beta-galactosidase
Ligand
BDBM50204111
Substrate
Meas. Tech.
ChEMBL_1626901 (CHEMBL3869422)
IC50
266000±n/a nM
Citation
 Miyawaki, SHirokami, YKinami, KHoshino, MMinehira, DMiyamoto, DNash, RJFleet, GWAdachi, IToyooka, NKato, A Strategy for designing selectivea-l-rhamnosidase inhibitors: Synthesis and biological evaluation of l-DMDP cyclic isothioureas. Bioorg Med Chem 25:107-115 (2017)  
Target
Name:
Beta-galactosidase
Synonyms:
β-galactosidase Beta-galactosidase/Glucosylceramidase | GLB1
Type:
Protein
Mol. Mass.:
73420.88
Organism:
Bos taurus (Bovine)
Description:
Residue:
653
  
Inhibitor
Name:
BDBM50204111
Synonyms:
CHEMBL3961105
Type:
Small organic molecule
Emp. Form.:
C15H30N2O4S
Mol. Mass.:
334.475
SMILES:
CCCCCCCCNC(=S)N1[C@@H](CO)[C@H](O)[C@@H](O)[C@@H]1CO
: