Target
Beta-galactosidase
Ligand
BDBM50204113
Substrate
Meas. Tech.
ChEMBL_1626901 (CHEMBL3869422)
IC50
93000±n/a nM
Citation
 Miyawaki, SHirokami, YKinami, KHoshino, MMinehira, DMiyamoto, DNash, RJFleet, GWAdachi, IToyooka, NKato, A Strategy for designing selectivea-l-rhamnosidase inhibitors: Synthesis and biological evaluation of l-DMDP cyclic isothioureas. Bioorg Med Chem 25:107-115 (2017)  
Target
Name:
Beta-galactosidase
Synonyms:
β-galactosidase Beta-galactosidase/Glucosylceramidase | GLB1
Type:
Protein
Mol. Mass.:
73420.88
Organism:
Bos taurus (Bovine)
Description:
Residue:
653
  
Inhibitor
Name:
BDBM50204113
Synonyms:
CHEMBL3897971
Type:
Small organic molecule
Emp. Form.:
C17H32N2O3S
Mol. Mass.:
344.513
SMILES:
[H][C@]12CS\C(=N\CCCCCCCCCC)N1[C@H](CO)[C@@H](O)[C@@H]2O
: