Target
Glucose-dependent insulinotropic receptor
Ligand
BDBM50204219
Substrate
Meas. Tech.
ChEMBL_1626987 (CHEMBL3869508)
EC50
0.600000±n/a nM
Citation
 Fang, YYang, ZGundeti, SLee, JPark, H Novel 5-nitropyrimidine derivatives bearing endo-azabicyclic alcohols/amines as potent GPR119 agonists. Bioorg Med Chem 25:254-260 (2017)  
Target
Name:
Glucose-dependent insulinotropic receptor
Synonyms:
G-protein coupled receptor 119 (GPR119) GPR119 | Glucose-dependent insulinotropic receptor
Type:
Protein
Mol. Mass.:
36901.49
Organism:
Homo sapiens (Human)
Description:
Q8TDV5
Residue:
335
  
Inhibitor
Name:
BDBM50204219
Synonyms:
CHEMBL3893596
Type:
Small organic molecule
Emp. Form.:
C22H26FN5O7S
Mol. Mass.:
523.535
SMILES:
CC(C)OC(=O)N1[C@@H]2CC[C@@H]1CC(C2)Oc1ncnc(Nc2ccc(cc2F)S(C)(=O)=O)c1[N+]([O-])=O
: