Target
Glucose-dependent insulinotropic receptor
Ligand
BDBM50204226
Substrate
Meas. Tech.
ChEMBL_1626987 (CHEMBL3869508)
EC50
1.5±n/a nM
Citation
 Fang, YYang, ZGundeti, SLee, JPark, H Novel 5-nitropyrimidine derivatives bearing endo-azabicyclic alcohols/amines as potent GPR119 agonists. Bioorg Med Chem 25:254-260 (2017)  
Target
Name:
Glucose-dependent insulinotropic receptor
Synonyms:
G-protein coupled receptor 119 (GPR119) GPR119 | Glucose-dependent insulinotropic receptor
Type:
Protein
Mol. Mass.:
36901.49
Organism:
Homo sapiens (Human)
Description:
Q8TDV5
Residue:
335
  
Inhibitor
Name:
BDBM50204226
Synonyms:
CHEMBL3914281
Type:
Small organic molecule
Emp. Form.:
C23H29FN6O6S
Mol. Mass.:
536.576
SMILES:
CC(C)(C)OC(=O)N1[C@@H]2CC[C@@H]1CC(C2)Nc1ncnc(Nc2ccc(cc2F)S(C)(=O)=O)c1[N+]([O-])=O
: