Target
Metabotropic glutamate receptor 3
Ligand
BDBM50204259
Substrate
Meas. Tech.
ChEMBL_1627029 (CHEMBL3869550)
IC50
14±n/a nM
Citation
 Dressman, BATromiczak, EGChappell, MDTripp, AEQuimby, SJVetman, TFivush, AMMatt, JJaramillo, CLi, RKhilevich, ABlanco, MJSmith, SCCarpintero, Mde Diego, JEBarberis, MGarcía-Cerrada, SSoriano, JFSchkeryantz, JMWitkin, JMWafford, KASeidel, WBritton, TOvershiner, CDLi, XWang, XSHeinz, BACatlow, JTSwanson, SBedwell, DOrnstein, PLMitch, CH Novel bicyclo[3.1.0]hexane analogs as antagonists of metabotropic glutamate 2/3 receptors for the treatment of depression. Bioorg Med Chem Lett 26:5663-5668 (2016)  
Target
Name:
Metabotropic glutamate receptor 3
Synonyms:
GPRC1C GRM3_HUMAN metabotropic glutamate 3 metabotropic glutamate 3/1c
Type:
Enzyme Catalytic Domain
Mol. Mass.:
98889.09
Organism:
Homo sapiens (Human)
Description:
metabotropic glutamate 1c 0 HUMAN::Q14832
Residue:
879
  
Inhibitor
Name:
BDBM50204259
Synonyms:
CHEMBL3913414
Type:
Small organic molecule
Emp. Form.:
C17H18Cl2N2O6
Mol. Mass.:
417.241
SMILES:
[H][C@]12[C@H](C(O)=O)[C@@]1([H])[C@@](N)([C@H](OCc1ccc(Cl)c(Cl)c1)[C@H]2NC(C)=O)C(O)=O
: