Target
Calcium release-activated calcium channel protein 1
Ligand
BDBM31773
Substrate
Meas. Tech.
ChEMBL_1627486 (CHEMBL3870007)
IC50
17000±n/a nM
Citation
 Azimi, IFlanagan, JUStevenson, RJInserra, MVetter, IMonteith, GRDenny, WA Evaluation of known and novel inhibitors of Orai1-mediated store operated Ca Bioorg Med Chem 25:440-449 (2017)  
Target
Name:
Calcium release-activated calcium channel protein 1
Synonyms:
CRACM1 Calcium channel (VER) Calcium release-activated calcium channel protein 1 Protein orai-1 Transmembrane protein 142A
Type:
Protein
Mol. Mass.:
32676.63
Organism:
Homo sapiens (Human)
Description:
Q96D31
Residue:
301
  
Inhibitor
Name:
BDBM31773
Synonyms:
ECONAZOLE Gyno-pevaryl cid_68589
Type:
Small organic molecule
Emp. Form.:
C18H15Cl3N2O
Mol. Mass.:
381.684
SMILES:
Clc1ccc(COC(Cn2ccnc2)c2ccc(Cl)cc2Cl)cc1
: