Target
Calcium release-activated calcium channel protein 1
Ligand
BDBM50117922
Substrate
Meas. Tech.
ChEMBL_1627486 (CHEMBL3870007)
IC50
>100000±n/a nM
Citation
 Azimi, IFlanagan, JUStevenson, RJInserra, MVetter, IMonteith, GRDenny, WA Evaluation of known and novel inhibitors of Orai1-mediated store operated Ca Bioorg Med Chem 25:440-449 (2017)  
Target
Name:
Calcium release-activated calcium channel protein 1
Synonyms:
CRACM1 Calcium channel (VER) Calcium release-activated calcium channel protein 1 Protein orai-1 Transmembrane protein 142A
Type:
Protein
Mol. Mass.:
32676.63
Organism:
Homo sapiens (Human)
Description:
Q96D31
Residue:
301
  
Inhibitor
Name:
BDBM50117922
Synonyms:
(1S,2S)-2-(2-((3-(1H-benzo[d]imidazol-2-yl)propyl)(methyl)amino)ethyl)-6-fluoro-1-isopropyl-1,2,3,4-tetrahydronaphthalen-2-yl 2-methoxyacetate CHEMBL45816 Methoxy-acetic acid (1S,2S)-2-(2-{[3-(1H-benzoimidazol-2-yl)-propyl]-methyl-amino}-ethyl)-6-fluoro-1-isopropyl-1,2,3,4-tetrahydro-naphthalen-2-yl ester Mibefradil dihydrochloride
Type:
Small organic molecule
Emp. Form.:
C29H38FN3O3
Mol. Mass.:
495.6287
SMILES:
COCC(=O)O[C@]1(CCN(C)CCCc2nc3ccccc3[nH]2)CCc2cc(F)ccc2[C@@H]1C(C)C
: