Target
Calcium release-activated calcium channel protein 1
Ligand
BDBM50204543
Substrate
Meas. Tech.
ChEMBL_1627486 (CHEMBL3870007)
IC50
75000±n/a nM
Citation
 Azimi, IFlanagan, JUStevenson, RJInserra, MVetter, IMonteith, GRDenny, WA Evaluation of known and novel inhibitors of Orai1-mediated store operated Ca Bioorg Med Chem 25:440-449 (2017)  
Target
Name:
Calcium release-activated calcium channel protein 1
Synonyms:
CRACM1 Calcium channel (VER) Calcium release-activated calcium channel protein 1 Protein orai-1 Transmembrane protein 142A
Type:
Protein
Mol. Mass.:
32676.63
Organism:
Homo sapiens (Human)
Description:
Q96D31
Residue:
301
  
Inhibitor
Name:
BDBM50204543
Synonyms:
CHEMBL1545070
Type:
Small organic molecule
Emp. Form.:
C25H32N2O3
Mol. Mass.:
408.5332
SMILES:
COc1ccc(OCC(=O)N2CCN(CC2)C2CCC(CC2)c2ccccc2)cc1
: