Target
Calcium release-activated calcium channel protein 1
Ligand
BDBM50204535
Substrate
Meas. Tech.
ChEMBL_1627486 (CHEMBL3870007)
IC50
100000±n/a nM
Citation
 Azimi, IFlanagan, JUStevenson, RJInserra, MVetter, IMonteith, GRDenny, WA Evaluation of known and novel inhibitors of Orai1-mediated store operated Ca Bioorg Med Chem 25:440-449 (2017)  
Target
Name:
Calcium release-activated calcium channel protein 1
Synonyms:
CRACM1 Calcium channel (VER) Calcium release-activated calcium channel protein 1 Protein orai-1 Transmembrane protein 142A
Type:
Protein
Mol. Mass.:
32676.63
Organism:
Homo sapiens (Human)
Description:
Q96D31
Residue:
301
  
Inhibitor
Name:
BDBM50204535
Synonyms:
CHEMBL3972536
Type:
Small organic molecule
Emp. Form.:
C14H11Cl2NO3
Mol. Mass.:
312.148
SMILES:
Clc1cc(Cl)c(OCCOc2cccnc2)c(C=O)c1
: