Target
Acetylcholinesterase
Ligand
BDBM50204661
Substrate
Meas. Tech.
ChEMBL_1627863 (CHEMBL3870448)
Ki
83100±n/a nM
Citation
 Olsen, JIPlata, GBPadrón, JMLópez, ÓBols, MFernández-Bolaños, JG Selenoureido-iminosugars: A new family of multitarget drugs. Eur J Med Chem 123:155-160 (2016)  
Target
Name:
Acetylcholinesterase
Synonyms:
ACES_ELEEL Acetylcholinesterase (EeAChE) | ache
Type:
Enzyme
Mol. Mass.:
71812.79
Organism:
Electrophorus electricus (Electric eel)
Description:
Residue:
633
  
Inhibitor
Name:
BDBM50204661
Synonyms:
CHEMBL3892394
Type:
Small organic molecule
Emp. Form.:
C19H31N3O5Se
Mol. Mass.:
460.43
SMILES:
COc1ccc(NC(=[Se])NCCCCCN2C[C@H](O)[C@@H](O)[C@H](O)[C@H]2CO)cc1
: