Target
Cholinesterase
Ligand
BDBM50204754
Substrate
Meas. Tech.
ChEMBL_1627947 (CHEMBL3870532)
IC50
8130±n/a nM
Citation
 Wang, ZMCai, PLiu, QHXu, DQYang, XLWu, JJKong, LYWang, XB Rational modification of donepezil as multifunctional acetylcholinesterase inhibitors for the treatment of Alzheimer's disease. Eur J Med Chem 123:282-297 (2016)  
Target
Name:
Cholinesterase
Synonyms:
Acylcholine acylhydrolase Butyrylcholine esterase (BChE) Butyrylcholinesterase (BuChE) CHLE_HUMAN Cholinesterases Pseudocholinesterase
Type:
Homotetramer
Mol. Mass.:
68422.27
Organism:
Homo sapiens (Human)
Description:
P06276
Residue:
602
  
Inhibitor
Name:
BDBM50204754
Synonyms:
CHEMBL3985059
Type:
Small organic molecule
Emp. Form.:
C24H28FNO3
Mol. Mass.:
397.4824
SMILES:
COc1cc2CC(CC3CCN(Cc4ccc(F)cc4)CC3)C(=O)c2cc1OC
: