Target
Glutamate receptor ionotropic, NMDA 1/2A
Ligand
BDBM50164400
Substrate
Meas. Tech.
ChEBML_1628575
EC50
440±n/a nM
Citation
 Villemure, EVolgraf, MJiang, YWu, GLy, CQYuen, PWLu, ALuo, XLiu, MZhang, SLupardus, PJWallweber, HJLiederer, BMDeshmukh, GPlise, ETay, SWang, TMHanson, JEHackos, DHScearce-Levie, KSchwarz, JBSellers, BD GluN2A-Selective Pyridopyrimidinone Series of NMDAR Positive Allosteric Modulators with an Improved ACS Med Chem Lett 8:84-89 (2017)  
Target
Name:
Glutamate receptor ionotropic, NMDA 1/2A
Synonyms:
Glutamate NMDA receptor; GRIN1/GRIN2A NR1/NR2A
Type:
Protein
Mol. Mass.:
Description:
Components:
This complex has 2 components.
Component 1
Name:
Glutamate receptor ionotropic, NMDA 1
Synonyms:
GRIN1 Glutamate [NMDA] receptor subunit zeta-1 N-methyl-D-aspartate receptor subunit NR1 NMDZ1_HUMAN | phencyclidine
Type:
Enzyme Catalytic Domain
Mol. Mass.:
105397.81
Organism:
Homo sapiens (Human)
Description:
Q05586
Residue:
938
  
Component 2
Name:
Glutamate receptor ionotropic, NMDA 2A
Synonyms:
GRIN2A Glutamate [NMDA] receptor Glutamate [NMDA] receptor subunit epsilon-1 NMDA receptor subtype 2A protein (NR2A) NMDE1_HUMAN hNR2A
Type:
Mol. Mass.:
165293.76
Organism:
Homo sapiens (Human)
Description:
Residue:
1464
  
Inhibitor
Name:
BDBM50164400
Synonyms:
CHEMBL3799694
Type:
Small organic molecule
Emp. Form.:
C15H13ClF3N5O2S
Mol. Mass.:
419.809
SMILES:
CCNC(=O)c1c(C)sc2nc(Cn3nc(cc3Cl)C(F)(F)F)cc(=O)n12
: