Target
5-hydroxytryptamine receptor 2B
Ligand
BDBM50206718
Substrate
Meas. Tech.
ChEMBL_1629228 (CHEMBL3871854)
Ki
6.3±n/a nM
Citation
 Schrader, TOKasem, MRen, AFeichtinger, KAl Doori, BWei, JWu, CDang, HLe, MGatlin, JChase, KDong, JWhelan, KTSage, CGrottick, AJSemple, G Tetrahydroquinoline-based tricyclic amines as potent and selective agonists of the 5-HT Bioorg Med Chem Lett 26:5877-5882 (2016)  
Target
Name:
5-hydroxytryptamine receptor 2B
Synonyms:
5-HT-2B 5-hydroxytryptamine (serotonin) receptor 2B [Homo sapiens] 5-hydroxytryptamine receptor 2C (5HT2C) HTR2B Serotonin 2b (5-HT2b) receptor | Serotonin Receptor 2B
Type:
G Protein-Coupled Receptor (GPCR)
Mol. Mass.:
54312.47
Organism:
Homo sapiens (Human)
Description:
Receptor binding assays were performed using human clone stably expressed in CHO cells.
Residue:
481
  
Inhibitor
Name:
BDBM50206718
Synonyms:
CHEMBL3895972
Type:
Small organic molecule
Emp. Form.:
C14H19ClN2
Mol. Mass.:
250.767
SMILES:
CC1(C)Cc2cccc(Cl)c2N2CCNCC12
: