Target
Free fatty acid receptor 4
Ligand
BDBM50207064
Substrate
Meas. Tech.
ChEMBL_1629515 (CHEMBL3872141)
EC50
37±n/a nM
Citation
 Adams, GLVelazquez, FJayne, CShah, UMiao, SAshley, ERMadeira, MAkiyama, TEDi Salvo, JSuzuki, TWang, NTruong, QGilbert, EZhou, DVerras, AKirkland, MPachanski, MPowles, MYin, WUjjainwalla, FVenkatraman, SEdmondson, SD Discovery of Chromane Propionic Acid Analogues as Selective Agonists of GPR120 with ACS Med Chem Lett 8:96-101 (2017)  
Target
Name:
Free fatty acid receptor 4
Synonyms:
FFAR4 G-protein coupled receptor 120 G-protein coupled receptor GT01 GPR120 O3FAR1 PGR4
Type:
PROTEIN
Mol. Mass.:
42256.91
Organism:
Homo sapiens (Human)
Description:
ChEMBL_1508994
Residue:
377
  
Inhibitor
Name:
BDBM50207064
Synonyms:
CHEMBL3943315
Type:
Small organic molecule
Emp. Form.:
C23H22FNO5S
Mol. Mass.:
443.488
SMILES:
COc1cc(Oc2ncc(C)s2)cc(c1F)-c1ccc2O[C@@H](CCC(O)=O)CCc2c1
: