Target
Prostaglandin E synthase
Ligand
BDBM50207330
Substrate
Meas. Tech.
ChEMBL_1630871 (CHEMBL3873577)
IC50
78±n/a nM
Citation
 Muthukaman, NDeshmukh, SSarode, NTondlekar, STambe, MPisal, DShaikh, MKattige, VGHonnegowda, SKarande, VKulkarni, AJadhav, SBMahat, MYAGudi, GSKhairatkar-Joshi, NGharat, LA Discovery of 2-((2-chloro-6-fluorophenyl)amino)-N-(3-fluoro-5-(trifluoromethyl)phenyl)-1-methyl-7,8-dihydro-1H-[1,4]dioxino[2',3':3,4]benzo[1,2-d]imidazole-5-carboxamide as potent, selective and efficacious microsomal prostaglandin E Bioorg Med Chem Lett 26:5977-5984 (2016)  
Target
Name:
Prostaglandin E synthase
Synonyms:
MGST1L1 PGES PTGES Prostaglandin E synthase (PGES-1) Prostaglandin E synthase-1 (PGES-1) Prostaglandin E2 synthase-1 ( mPGES-1)
Type:
Protein
Mol. Mass.:
17112.22
Organism:
Homo sapiens (Human)
Description:
Residue:
152
  
Inhibitor
Name:
BDBM50207330
Synonyms:
CHEMBL3952826
Type:
Small organic molecule
Emp. Form.:
C27H21ClFN5O3
Mol. Mass.:
517.939
SMILES:
Cn1c(Nc2c(F)cccc2Cl)nc2cc(C(=O)Nc3ccc(nc3)C#CC3CC3)c3OCCOc3c12
: