Target
Free fatty acid receptor 4
Ligand
BDBM50208071
Substrate
Meas. Tech.
ChEMBL_1632273 (CHEMBL3874979)
EC50
>10000±n/a nM
Citation
 Cox, JMChu, HDChelliah, MVDebenham, JSEagen, KLan, PLombardo, MLondon, CPlotkin, MAShah, USun, ZVaccaro, HMVenkatraman, SSuzuki, TWang, NAshley, ERCrespo, AMadeira, MLeung, DHAlleyne, COgawa, AMSouza, SThomas-Fowlkes, BDi Salvo, JWeinglass, AKirkland, MPachanski, MPowles, MATozzo, EAkiyama, TEUjjainwalla, FTata, JRSinz, CJ Design, Synthesis, and Evaluation of Novel and Selective G-protein Coupled Receptor 120 (GPR120) Spirocyclic Agonists. ACS Med Chem Lett 8:49-54 (2017)  
Target
Name:
Free fatty acid receptor 4
Synonyms:
FFAR4_MOUSE Free fatty acid receptor 4 Gpr120 Omega-3 fatty acid receptor 1
Type:
PROTEIN
Mol. Mass.:
40828.60
Organism:
Mus musculus
Description:
ChEMBL_1454435
Residue:
361
  
Inhibitor
Name:
BDBM50208071
Synonyms:
CHEMBL3964985
Type:
Small organic molecule
Emp. Form.:
C19H17F4NO3
Mol. Mass.:
383.3368
SMILES:
OC(=O)c1ccc(cc1)C1CCN(CC1)c1cc(OC(F)(F)F)ccc1F
: