Target
WD repeat-containing protein 5
Ligand
BDBM50208354
Substrate
Meas. Tech.
ChEMBL_1632710 (CHEMBL3875502)
IC50
7.6±n/a nM
Citation
 Li, DDChen, WLWang, ZHXie, YYXu, XLJiang, ZYZhang, XJYou, QDGuo, XK High-affinity small molecular blockers of mixed lineage leukemia 1 (MLL1)-WDR5 interaction inhibit MLL1 complex H3K4 methyltransferase activity. Eur J Med Chem 124:480-489 (2016)  
Target
Name:
WD repeat-containing protein 5
Synonyms:
BIG3 WD repeat-containing protein 5 (WDR5) WDR5 | WDR5_HUMAN
Type:
Protein
Mol. Mass.:
36597.13
Organism:
Homo sapiens (Human)
Description:
P61964
Residue:
334
  
Inhibitor
Name:
BDBM50208354
Synonyms:
CHEMBL3884329
Type:
Small organic molecule
Emp. Form.:
C29H34ClFN6O2
Mol. Mass.:
553.071
SMILES:
CN1CCN(CC1)c1ccc(cc1NC(=O)c1cc(N)c(F)c(C)c1Cl)-c1ccc(NC(=O)CCCN)cc1
: