Target
WD repeat-containing protein 5
Ligand
BDBM200723
Substrate
Meas. Tech.
ChEMBL_1632743 (CHEMBL3875535)
IC50
2.4±n/a nM
Citation
 Li, DDChen, WLWang, ZHXie, YYXu, XLJiang, ZYZhang, XJYou, QDGuo, XK High-affinity small molecular blockers of mixed lineage leukemia 1 (MLL1)-WDR5 interaction inhibit MLL1 complex H3K4 methyltransferase activity. Eur J Med Chem 124:480-489 (2016)  
Target
Name:
WD repeat-containing protein 5
Synonyms:
BIG3 WD repeat-containing protein 5 (WDR5) WDR5 | WDR5_HUMAN
Type:
Protein
Mol. Mass.:
36597.13
Organism:
Homo sapiens (Human)
Description:
P61964
Residue:
334
  
Inhibitor
Name:
BDBM200723
Synonyms:
US9233086, 10L
Type:
Small organic molecule
Emp. Form.:
C35H49F2N7O4
Mol. Mass.:
669.8049
SMILES:
CCC(CC)(NC(=O)C(C)C)C(=O)N[C@@H](CCCNC(N)=N)C(=O)NC1(CCCC1)C(=O)NC(c1ccc(F)cc1)c1ccc(F)cc1
: