Target
5-hydroxytryptamine receptor 1A
Ligand
BDBM50208447
Substrate
Meas. Tech.
ChEMBL_1632885 (CHEMBL3875677)
Ki
5.9±n/a nM
Citation
 Cao, XChen, YZhang, YQiu, YYu, MXu, XLiu, XLiu, BFZhang, G Synthesis and biological evaluation of new 6-hydroxypyridazinone benzisoxazoles: Potential multi-receptor-targeting atypical antipsychotics. Eur J Med Chem 124:713-728 (2016)  
Target
Name:
5-hydroxytryptamine receptor 1A
Synonyms:
5-HT-1A 5-HT1A 5-hydroxytryptamine receptor 1A (5HT1A) 5ht1a Htr1a Serotonin 1a (5-HT1a) receptor/Adrenergic receptor alpha-1 | Serotonin receptor 1A
Type:
G Protein-Coupled Receptor (GPCR)
Mol. Mass.:
46445.29
Organism:
Rattus norvegicus (rat)
Description:
Binding assays were performed using rat hippocampal membranes.
Residue:
422
  
Inhibitor
Name:
BDBM50208447
Synonyms:
CHEMBL3883955
Type:
Small organic molecule
Emp. Form.:
C25H23F3N4O3
Mol. Mass.:
484.4703
SMILES:
Fc1ccc2c(noc2c1)C1CCN(CCCOc2ccc(=O)n(n2)-c2c(F)cccc2F)CC1
: