Target
Ephrin type-A receptor 8
Ligand
BDBM50208911
Substrate
Meas. Tech.
ChEMBL_1633310 (CHEMBL3876102)
IC50
10000±n/a nM
Citation
 Katz, JDHaidle, AChilders, KKZabierek, AAJewell, JPHou, YAltman, MDSzewczak, AChen, DHarsch, AHayashi, MWarren, LHutton, MNuthall, HSu, HPMunshi, SStanton, MGDavies, IWMunoz, BNorthrup, A Structure guided design of a series of selective pyrrolopyrimidinone MARK inhibitors. Bioorg Med Chem Lett 27:114-120 (2017)  
Target
Name:
Ephrin type-A receptor 8
Synonyms:
EEK EPHA8_HUMAN Ephrin type-A receptor 8 KIAA1459
Type:
PROTEIN
Mol. Mass.:
111022.09
Organism:
Homo sapiens (Human)
Description:
ChEMBL_774600
Residue:
1005
  
Inhibitor
Name:
BDBM50208911
Synonyms:
CHEMBL3884319
Type:
Small organic molecule
Emp. Form.:
C23H22N4O2
Mol. Mass.:
386.4464
SMILES:
CC1(C)C(=O)N([C@H]2CCc3c2cccc3O)c2nc(Nc3ccccc3)ncc12
: