Target
Sphingosine 1-phosphate receptor 5
Ligand
BDBM50209025
Substrate
Meas. Tech.
ChEMBL_1633656 (CHEMBL3876448)
EC50
22±n/a nM
Citation
 Hur, WRosen, HGray, NS A benzo[b]thiophene-based selective type 4 S1P receptor agonist. Bioorg Med Chem Lett 27:1-5 (2017)  
Target
Name:
Sphingosine 1-phosphate receptor 5
Synonyms:
EDG8 S1P5 S1PR5_HUMAN Sphingosine 1-phosphate receptor Edg-8
Type:
G Protein-Coupled Receptor (GPCR)
Mol. Mass.:
41796.42
Organism:
Homo sapiens (Human)
Description:
Residue:
398
  
Inhibitor
Name:
BDBM50209025
Synonyms:
CHEMBL3883597
Type:
Small organic molecule
Emp. Form.:
C23H19NO2S
Mol. Mass.:
373.467
SMILES:
OC(=O)C1CN(Cc2cc3cc(ccc3s2)-c2ccc3ccccc3c2)C1
: