Target
Metabotropic glutamate receptor 2
Ligand
BDBM50209116
Substrate
Meas. Tech.
ChEMBL_1633737 (CHEMBL3876529)
EC50
0.400000±n/a nM
Citation
 Higgins, MAMarcin, LRChristopher Zusi, FGentles, RDing, MPearce, BCEaston, AKostich, WASeager, MABourin, CBristow, LJJohnson, KAMiller, RHogan, JWhiterock, VGulianello, MFerrante, MHuang, YHendricson, AAlt, AMacor, JEBronson, JJ Triazolopyridine ethers as potent, orally active mGlu Bioorg Med Chem 25:496-513 (2017)  
Target
Name:
Metabotropic glutamate receptor 2
Synonyms:
GPRC1B GRM2_HUMAN Metabotropic glutamate receptor mGlu2 | metabotropic glutamate 2
Type:
Enzyme
Mol. Mass.:
95584.88
Organism:
Homo sapiens (Human)
Description:
Q14416
Residue:
872
  
Inhibitor
Name:
BDBM50209116
Synonyms:
CHEMBL3883435
Type:
Small organic molecule
Emp. Form.:
C21H19F4N3O
Mol. Mass.:
405.3887
SMILES:
Fc1ccc(cc1)C1CC(C1)Oc1ccn2c(CC3CC3)nnc2c1C(F)(F)F
: