Target
Carbonic anhydrase 2
Ligand
BDBM26989
Substrate
Meas. Tech.
ChEMBL_1633801 (CHEMBL3876593)
Ki
63000000±n/a nM
Citation
 Del Prete, SVullo, DDi Fonzo, POsman, SMAlOthman, ZSupuran, CTCapasso, C Anion inhibition profiles of theż-carbonic anhydrase from the pathogenic bacterium Burkholderia pseudomallei responsible of melioidosis and highly drug resistant to common antibiotics. Bioorg Med Chem 25:575-580 (2017)  
Target
Name:
Carbonic anhydrase 2
Synonyms:
CA-II CAC Carbonate dehydratase II Carbonic anhydrase 2 (CA-II) Carbonic anhydrase C Carbonic anhydrase II (CA-II) Carbonic anhydrase II (hCA II) | Carbonic anhydrase isoenzyme II (hCA II)
Type:
Enzyme
Mol. Mass.:
29250.71
Organism:
Homo sapiens (Human)
Description:
P00918
Residue:
260
  
Inhibitor
Name:
BDBM26989
Synonyms:
CHEMBL93268 nitrite | nitrite ion
Type:
Ion
Emp. Form.:
NO2
Mol. Mass.:
46.006
SMILES:
[O-]N=O
: