Target
Histone deacetylase 3
Ligand
BDBM50209789
Substrate
Meas. Tech.
ChEBML_1634160
IC50
35±n/a nM
Citation
 Raji, IYadudu, FJaneira, EFathi, SSzymczak, LKornacki, JRKomatsu, KLi, JDMrksich, MOyelere, AK Bifunctional conjugates with potent inhibitory activity towards cyclooxygenase and histone deacetylase. Bioorg Med Chem 25:1202-1218 (2017)  
Target
Name:
Histone deacetylase 3
Synonyms:
HD3 HDAC3_HUMAN Human HDAC3 SMAP45
Type:
Enzyme
Mol. Mass.:
48829.55
Organism:
Homo sapiens (Human)
Description:
O15379
Residue:
428
  
Inhibitor
Name:
BDBM50209789
Synonyms:
CHEMBL3885174
Type:
Small organic molecule
Emp. Form.:
C29H35N5O5
Mol. Mass.:
533.6187
SMILES:
COC(=O)Cc1c(C)n(Cc2ccc(cc2)-c2cn(CCCCCCC(=O)NO)nn2)c2ccc(OC)cc12
: