Target
Histone deacetylase 3
Ligand
BDBM50209790
Substrate
Meas. Tech.
ChEBML_1634160
IC50
356±n/a nM
Citation
 Raji, IYadudu, FJaneira, EFathi, SSzymczak, LKornacki, JRKomatsu, KLi, JDMrksich, MOyelere, AK Bifunctional conjugates with potent inhibitory activity towards cyclooxygenase and histone deacetylase. Bioorg Med Chem 25:1202-1218 (2017)  
Target
Name:
Histone deacetylase 3
Synonyms:
HD3 HDAC3_HUMAN Human HDAC3 SMAP45
Type:
Enzyme
Mol. Mass.:
48829.55
Organism:
Homo sapiens (Human)
Description:
O15379
Residue:
428
  
Inhibitor
Name:
BDBM50209790
Synonyms:
CHEMBL3885367
Type:
Small organic molecule
Emp. Form.:
C26H30ClN3O5
Mol. Mass.:
499.987
SMILES:
COc1ccc2n(C(=O)c3ccc(Cl)cc3)c(C)c(CC(=O)NCCCCCCC(=O)NO)c2c1
: