Target
Histone deacetylase 2
Ligand
BDBM50209788
Substrate
Meas. Tech.
ChEMBL_1634158 (CHEMBL3876950)
IC50
302±n/a nM
Citation
 Raji, IYadudu, FJaneira, EFathi, SSzymczak, LKornacki, JRKomatsu, KLi, JDMrksich, MOyelere, AK Bifunctional conjugates with potent inhibitory activity towards cyclooxygenase and histone deacetylase. Bioorg Med Chem 25:1202-1218 (2017)  
Target
Name:
Histone deacetylase 2
Synonyms:
Cereblon/Histone deacetylase 2 HDAC2 Histone deacetylase 2 (HDAC2) | Human HDAC2
Type:
Chromatin regulator; hydrolase; repressor
Mol. Mass.:
55356.54
Organism:
Homo sapiens (Human)
Description:
Q92769
Residue:
488
  
Inhibitor
Name:
BDBM50209788
Synonyms:
CHEMBL3884506
Type:
Small organic molecule
Emp. Form.:
C28H33N5O5
Mol. Mass.:
519.5921
SMILES:
COc1ccc2n(Cc3ccc(cc3)-c3cn(CCCCCCC(=O)NO)nn3)c(C)c(CC(O)=O)c2c1
: