Target
Histone deacetylase 2
Ligand
BDBM50209796
Substrate
Meas. Tech.
ChEMBL_1634158 (CHEMBL3876950)
IC50
209±n/a nM
Citation
 Raji, IYadudu, FJaneira, EFathi, SSzymczak, LKornacki, JRKomatsu, KLi, JDMrksich, MOyelere, AK Bifunctional conjugates with potent inhibitory activity towards cyclooxygenase and histone deacetylase. Bioorg Med Chem 25:1202-1218 (2017)  
Target
Name:
Histone deacetylase 2
Synonyms:
Cereblon/Histone deacetylase 2 HDAC2 Histone deacetylase 2 (HDAC2) | Human HDAC2
Type:
Chromatin regulator; hydrolase; repressor
Mol. Mass.:
55356.54
Organism:
Homo sapiens (Human)
Description:
Q92769
Residue:
488
  
Inhibitor
Name:
BDBM50209796
Synonyms:
CHEMBL3885011
Type:
Small organic molecule
Emp. Form.:
C30H37N5O5
Mol. Mass.:
547.6453
SMILES:
COC(=O)Cc1c(C)n(Cc2ccc(cc2)-c2cn(CCCCCCCC(=O)NO)nn2)c2ccc(OC)cc12
: