Target
Histone deacetylase 6
Ligand
BDBM50209829
Substrate
Meas. Tech.
ChEMBL_1634161 (CHEMBL3876953)
IC50
61±n/a nM
Citation
 Raji, IYadudu, FJaneira, EFathi, SSzymczak, LKornacki, JRKomatsu, KLi, JDMrksich, MOyelere, AK Bifunctional conjugates with potent inhibitory activity towards cyclooxygenase and histone deacetylase. Bioorg Med Chem 25:1202-1218 (2017)  
Target
Name:
Histone deacetylase 6
Synonyms:
Cereblon/Histone deacetylase 6 HDAC6 Histone deacetylase 6 (HDAC6) KIAA0901 | ORF Names:JM21
Type:
Chromatin regulator; hydrolase; repressor
Mol. Mass.:
131381.51
Organism:
Homo sapiens (Human)
Description:
Q9UBN7
Residue:
1215
  
Inhibitor
Name:
BDBM50209829
Synonyms:
CHEMBL3883830
Type:
Small organic molecule
Emp. Form.:
C25H29F3N4O4S
Mol. Mass.:
538.582
SMILES:
Cc1ccc(cc1)-c1cc(nn1-c1ccc(cc1)S(=O)(=O)NCCCCCCCC(=O)NO)C(F)(F)F
: