Target
Histone deacetylase 3
Ligand
BDBM50209791
Substrate
Meas. Tech.
ChEMBL_1634160 (CHEMBL3876952)
IC50
33±n/a nM
Citation
 Raji, IYadudu, FJaneira, EFathi, SSzymczak, LKornacki, JRKomatsu, KLi, JDMrksich, MOyelere, AK Bifunctional conjugates with potent inhibitory activity towards cyclooxygenase and histone deacetylase. Bioorg Med Chem 25:1202-1218 (2017)  
Target
Name:
Histone deacetylase 3
Synonyms:
HD3 HDAC3_HUMAN Human HDAC3 SMAP45
Type:
Enzyme
Mol. Mass.:
48829.55
Organism:
Homo sapiens (Human)
Description:
O15379
Residue:
428
  
Inhibitor
Name:
BDBM50209791
Synonyms:
CHEMBL3883560
Type:
Small organic molecule
Emp. Form.:
C25H31N5O5S
Mol. Mass.:
513.609
SMILES:
Cc1ccc(cc1)-c1cc(nn1-c1ccc(cc1)S(N)(=O)=O)C(=O)NCCCCCCCC(=O)NO
: