Target
Histone deacetylase 2
Ligand
BDBM50209834
Substrate
Meas. Tech.
ChEMBL_1634158 (CHEMBL3876950)
IC50
163±n/a nM
Citation
 Raji, IYadudu, FJaneira, EFathi, SSzymczak, LKornacki, JRKomatsu, KLi, JDMrksich, MOyelere, AK Bifunctional conjugates with potent inhibitory activity towards cyclooxygenase and histone deacetylase. Bioorg Med Chem 25:1202-1218 (2017)  
Target
Name:
Histone deacetylase 2
Synonyms:
Cereblon/Histone deacetylase 2 HDAC2 Histone deacetylase 2 (HDAC2) | Human HDAC2
Type:
Chromatin regulator; hydrolase; repressor
Mol. Mass.:
55356.54
Organism:
Homo sapiens (Human)
Description:
Q92769
Residue:
488
  
Inhibitor
Name:
BDBM50209834
Synonyms:
CHEMBL3884141
Type:
Small organic molecule
Emp. Form.:
C25H30N4O5S
Mol. Mass.:
498.595
SMILES:
Cc1ccc(cc1)-c1cc(nn1-c1ccc(cc1)S(C)(=O)=O)C(=O)NCCCCCCC(=O)NO
: