Target
Myeloperoxidase
Ligand
BDBM81461
Substrate
Meas. Tech.
ChEMBL_1634340 (CHEMBL3877132)
IC50
900±n/a nM
Citation
 Soubhye, JGelbcke, MVan Antwerpen, PDufrasne, FBoufadi, MYNève, JFurtmüller, PGObinger, CZouaoui Boudjeltia, KMeyer, F From Dynamic Combinatorial Chemistry to ACS Med Chem Lett 8:206-210 (2017)  
Target
Name:
Myeloperoxidase
Synonyms:
84 kDa myeloperoxidase MPO Myeloperoxidase Myeloperoxidase heavy chain PERM_HUMAN
Type:
Enzyme
Mol. Mass.:
83888.32
Organism:
Homo sapiens (Human)
Description:
P05164
Residue:
745
  
Inhibitor
Name:
BDBM81461
Synonyms:
CAS_86-54-4 Hydralazine (HZN) | NSC_3637
Type:
Small organic molecule
Emp. Form.:
C8H8N4
Mol. Mass.:
160.1759
SMILES:
NNc1nncc2ccccc12
: