Target
Casein kinase I isoform epsilon
Ligand
BDBM50364141
Substrate
Meas. Tech.
ChEMBL_1634429 (CHEMBL3877221)
IC50
32±n/a nM
Citation
 Munoz, L Non-kinase targets of protein kinase inhibitors. Nat Rev Drug Discov 16:424-440 (2017)  
Target
Name:
Casein kinase I isoform epsilon
Synonyms:
Axin-1/Casein kinase I epsilon CKIe Casein kinase 1 epsilon (CK1Ɛ) Casein kinase I isoform epsilon (CK1 epsilon) Casein kinase I isoform epsilon (CK1epsilon) | KC1E_HUMAN
Type:
Protein
Mol. Mass.:
47340.25
Organism:
Homo sapiens (Human)
Description:
P49674
Residue:
416
  
Inhibitor
Name:
BDBM50364141
Synonyms:
CHEMBL1951415
Type:
Small organic molecule
Emp. Form.:
C19H20FN5
Mol. Mass.:
337.394
SMILES:
Nc1nccc(n1)-c1c(ncn1C1CCCCC1)-c1ccc(F)cc1
: