Target
Mitogen-activated protein kinase 14
Ligand
BDBM50411445
Substrate
Meas. Tech.
ChEMBL_1634383 (CHEMBL3877175)
IC50
330±n/a nM
Citation
 Munoz, L Non-kinase targets of protein kinase inhibitors. Nat Rev Drug Discov 16:424-440 (2017)  
Target
Name:
Mitogen-activated protein kinase 14
Synonyms:
Crk1 Csbp2 MAP kinase p38 Mapk14 Mitogen-activated protein kinase p38 alpha
Type:
Enzyme
Mol. Mass.:
41281.22
Organism:
Mus musculus (mouse)
Description:
The full-length open reading frame of murine p38 alpha was cloned and expressed in E. coli.. Soluble murine p38R was extracted from cell pellets and purified using ion-exchange chromatography.
Residue:
360
  
Inhibitor
Name:
BDBM50411445
Synonyms:
CHEMBL235658
Type:
Small organic molecule
Emp. Form.:
C22H20FNO2
Mol. Mass.:
349.3981
SMILES:
Oc1ccc(NC(=O)CCCc2ccc(cc2)-c2ccccc2F)cc1
: