Target
Bromodomain testis-specific protein
Ligand
BDBM192755
Substrate
Meas. Tech.
ChEMBL_1634390 (CHEMBL3877182)
IC50
230±n/a nM
Citation
 Munoz, L Non-kinase targets of protein kinase inhibitors. Nat Rev Drug Discov 16:424-440 (2017)  
Target
Name:
Bromodomain testis-specific protein
Synonyms:
BRDT Bromodomain and extra-terminal motif (BET) Cancer/testis antigen 9 | RING3-like protein
Type:
PROTEIN
Mol. Mass.:
107982.01
Organism:
Homo sapiens (Human)
Description:
ChEMBL_1502985
Residue:
947
  
Inhibitor
Name:
BDBM192755
Synonyms:
TG101209 US11643396, Example TG101209
Type:
Small organic molecule
Emp. Form.:
C26H35N7O2S
Mol. Mass.:
509.667
SMILES:
CN1CCN(CC1)c1ccc(Nc2ncc(C)c(Nc3cccc(c3)S(=O)(=O)NC(C)(C)C)n2)cc1
: