Target
Oxidized purine nucleoside triphosphate hydrolase
Ligand
BDBM50210163
Substrate
Meas. Tech.
ChEMBL_1634434 (CHEMBL3877226)
IC50
100±n/a nM
Citation
 Munoz, L Non-kinase targets of protein kinase inhibitors. Nat Rev Drug Discov 16:424-440 (2017)  
Target
Name:
Oxidized purine nucleoside triphosphate hydrolase
Synonyms:
2-hydroxy-dATP diphosphatase 3.6.1.56 8-oxo-dGTPase MTH1 MutT homolog 1 protein (MTH1) Nucleoside diphosphate-linked moiety X motif 1 Oxidized purine nucleoside triphosphate hydrolase [42-197]
Type:
Protein
Mol. Mass.:
22514.81
Organism:
Homo sapiens (Human)
Description:
P36639
Residue:
156
  
Inhibitor
Name:
BDBM50210163
Synonyms:
CHEMBL3883604
Type:
Small organic molecule
Emp. Form.:
C15H21N5
Mol. Mass.:
271.3607
SMILES:
CC12CC(CC(C)(C)C1)N(C2)c1ncnc2[nH]cnc12
: