Target
Casein kinase I isoform delta
Ligand
BDBM50399656
Substrate
Meas. Tech.
ChEMBL_1634428 (CHEMBL3877220)
IC50
32±n/a nM
Citation
 Munoz, L Non-kinase targets of protein kinase inhibitors. Nat Rev Drug Discov 16:424-440 (2017)  
Target
Name:
Casein kinase I isoform delta
Synonyms:
CKI-delta CSNK1D Casein kinase I delta Casein kinase I isoform delta (CK1D) KC1D_HUMAN | casein kinases 1 delta (CK1 delta)
Type:
Enzyme
Mol. Mass.:
47356.76
Organism:
Homo sapiens (Human)
Description:
P48730
Residue:
415
  
Inhibitor
Name:
BDBM50399656
Synonyms:
CHEMBL2069623 | US11633415, Compound PF4800567
Type:
Small organic molecule
Emp. Form.:
C17H18ClN5O2
Mol. Mass.:
359.81
SMILES:
Nc1ncnc2n(nc(COc3cccc(Cl)c3)c12)C1CCOCC1
: