Target
Tyrosine-protein kinase JAK2
Ligand
BDBM192755
Substrate
Meas. Tech.
ChEMBL_1634397 (CHEMBL3877189)
IC50
6.0±n/a nM
Citation
 Munoz, L Non-kinase targets of protein kinase inhibitors. Nat Rev Drug Discov 16:424-440 (2017)  
Target
Name:
Tyrosine-protein kinase JAK2
Synonyms:
JAK-2 JAK2_HUMAN Janus kinase 2 (JAK2) | Janus kinase 2 (a protein tyrosine kinase)
Type:
Protein
Mol. Mass.:
130684.68
Organism:
Homo sapiens (Human)
Description:
O60674
Residue:
1132
  
Inhibitor
Name:
BDBM192755
Synonyms:
TG101209 US11643396, Example TG101209
Type:
Small organic molecule
Emp. Form.:
C26H35N7O2S
Mol. Mass.:
509.667
SMILES:
CN1CCN(CC1)c1ccc(Nc2ncc(C)c(Nc3cccc(c3)S(=O)(=O)NC(C)(C)C)n2)cc1
: