Target
Adenosine receptor A1
Ligand
BDBM50210797
Substrate
Meas. Tech.
ChEMBL_1635279 (CHEMBL3878177)
Ki
180±n/a nM
Citation
 Alachouzos, GLenselink, EBMulder-Krieger, Tde Vries, HIJzerman, APLouvel, J Synthesis and evaluation of N-substituted 2-amino-4,5-diarylpyrimidines as selective adenosine A Eur J Med Chem 125:586-602 (2017)  
Target
Name:
Adenosine receptor A1
Synonyms:
A1 adenosine receptor (hA1) AA1R_HUMAN ADORA1 Adenosine A1-receptor Adenosine receptor A1 (hA1) | Adenosine transporter (AdT)
Type:
G Protein-Coupled Receptor (GPCR)
Mol. Mass.:
36520.92
Organism:
Homo sapiens (Human)
Description:
P30542
Residue:
326
  
Inhibitor
Name:
BDBM50210797
Synonyms:
CHEMBL3947529
Type:
Small organic molecule
Emp. Form.:
C18H16ClN3O
Mol. Mass.:
325.792
SMILES:
OCCNc1ncc(-c2cccc(Cl)c2)c(n1)-c1ccccc1
: