Target
Adenosine receptor A1
Ligand
BDBM50210818
Substrate
Meas. Tech.
ChEMBL_1635279 (CHEMBL3878177)
Ki
7.7±n/a nM
Citation
 Alachouzos, GLenselink, EBMulder-Krieger, Tde Vries, HIJzerman, APLouvel, J Synthesis and evaluation of N-substituted 2-amino-4,5-diarylpyrimidines as selective adenosine A Eur J Med Chem 125:586-602 (2017)  
Target
Name:
Adenosine receptor A1
Synonyms:
A1 adenosine receptor (hA1) AA1R_HUMAN ADORA1 Adenosine A1-receptor Adenosine receptor A1 (hA1) | Adenosine transporter (AdT)
Type:
G Protein-Coupled Receptor (GPCR)
Mol. Mass.:
36520.92
Organism:
Homo sapiens (Human)
Description:
P30542
Residue:
326
  
Inhibitor
Name:
BDBM50210818
Synonyms:
CHEMBL3937015
Type:
Small organic molecule
Emp. Form.:
C26H25N3O
Mol. Mass.:
395.4962
SMILES:
O[C@H]1CC[C@@H](CC1)Nc1ncc(-c2ccc3ccccc3c2)c(n1)-c1ccccc1
: