Target
Adenosine receptor A2a
Ligand
BDBM50210813
Substrate
Meas. Tech.
ChEMBL_1635281 (CHEMBL3878179)
Ki
1.3±n/a nM
Citation
 Alachouzos, GLenselink, EBMulder-Krieger, Tde Vries, HIJzerman, APLouvel, J Synthesis and evaluation of N-substituted 2-amino-4,5-diarylpyrimidines as selective adenosine A Eur J Med Chem 125:586-602 (2017)  
Target
Name:
Adenosine receptor A2a
Synonyms:
A2A adenosine receptor (hA2A) ADENOSINE A2 ADORA2 Adenosine A2A receptor (A2AAR)
Type:
G Protein-Coupled Receptor (GPCR)
Mol. Mass.:
44716.46
Organism:
Homo sapiens (Human)
Description:
P29274
Residue:
412
  
Inhibitor
Name:
BDBM50210813
Synonyms:
CHEMBL3916315
Type:
Small organic molecule
Emp. Form.:
C16H12ClN3O
Mol. Mass.:
297.739
SMILES:
Nc1ncc(-c2ccc(O)c(Cl)c2)c(n1)-c1ccccc1
: