Target
Adenosine receptor A2a
Ligand
BDBM50210814
Substrate
Meas. Tech.
ChEMBL_1635281 (CHEMBL3878179)
Ki
129±n/a nM
Citation
 Alachouzos, GLenselink, EBMulder-Krieger, Tde Vries, HIJzerman, APLouvel, J Synthesis and evaluation of N-substituted 2-amino-4,5-diarylpyrimidines as selective adenosine A Eur J Med Chem 125:586-602 (2017)  
Target
Name:
Adenosine receptor A2a
Synonyms:
A2A adenosine receptor (hA2A) ADENOSINE A2 ADORA2 Adenosine A2A receptor (A2AAR)
Type:
G Protein-Coupled Receptor (GPCR)
Mol. Mass.:
44716.46
Organism:
Homo sapiens (Human)
Description:
P29274
Residue:
412
  
Inhibitor
Name:
BDBM50210814
Synonyms:
CHEMBL3977929
Type:
Small organic molecule
Emp. Form.:
C20H15N3
Mol. Mass.:
297.3532
SMILES:
Nc1ncc(-c2ccc3ccccc3c2)c(n1)-c1ccccc1
: