Target
Adenosine receptor A2a
Ligand
BDBM50210807
Substrate
Meas. Tech.
ChEMBL_1635281 (CHEMBL3878179)
Ki
98±n/a nM
Citation
 Alachouzos, GLenselink, EBMulder-Krieger, Tde Vries, HIJzerman, APLouvel, J Synthesis and evaluation of N-substituted 2-amino-4,5-diarylpyrimidines as selective adenosine A Eur J Med Chem 125:586-602 (2017)  
Target
Name:
Adenosine receptor A2a
Synonyms:
A2A adenosine receptor (hA2A) ADENOSINE A2 ADORA2 Adenosine A2A receptor (A2AAR)
Type:
G Protein-Coupled Receptor (GPCR)
Mol. Mass.:
44716.46
Organism:
Homo sapiens (Human)
Description:
P29274
Residue:
412
  
Inhibitor
Name:
BDBM50210807
Synonyms:
CHEMBL3965184
Type:
Small organic molecule
Emp. Form.:
C17H12F3N3
Mol. Mass.:
315.2925
SMILES:
Nc1ncc(-c2cccc(c2)C(F)(F)F)c(n1)-c1ccccc1
: