Target
Diacylglycerol lipase-alpha
Ligand
BDBM50211240
Substrate
Meas. Tech.
ChEBML_1636270
IC50
0.630957±n/a nM
Citation
 Deng, HKooijman, Svan den Nieuwendijk, AMOgasawara, Dvan der Wel, Tvan Dalen, FBaggelaar, MPJanssen, FJvan den Berg, RJden Dulk, HCravatt, BFOverkleeft, HSRensen, PCvan der Stelt, M Triazole Ureas Act as Diacylglycerol Lipase Inhibitors and Prevent Fasting-Induced Refeeding. J Med Chem 60:428-440 (2017)  
Target
Name:
Diacylglycerol lipase-alpha
Synonyms:
C11orf11 DGLA_HUMAN NSDDR | Sn1-specific diacylglycerol lipase alpha
Type:
PROTEIN
Mol. Mass.:
114947.74
Organism:
Homo sapiens (Human)
Description:
ChEMBL_1449471
Residue:
1042
  
Inhibitor
Name:
BDBM50211240
Synonyms:
CHEMBL3897587
Type:
Small organic molecule
Emp. Form.:
C32H32F2N4O3
Mol. Mass.:
558.6183
SMILES:
OC(c1cnn(n1)C(=O)N1C[C@@H](CC[C@@H]1Cc1ccccc1)OCC1CC1)(c1ccc(F)cc1)c1ccc(F)cc1
: